Reaction Details
TargetNuclear receptor coactivator 3
LigandBDBM75541
Substrate/Competitorn/a
Meas. Tech.Luminescence-based cell-based high throughput dose response assay for inhibitors of the Steroid Receptor Coactivator 3 (SRC3; NCOA3)
IC50>1331±n/a nM
Citation PubChem, PC Luminescence-based cell-based high throughput dose response assay for inhibitors of the Steroid Receptor Coactivator 3 (SRC3; NCOA3) PubChem Bioassay(2012)[AID]
 
Nuclear receptor coactivator 3
Name:Nuclear receptor coactivator 3
Type:Enzyme Catalytic Domain
Mol. Mass.:155305.29
Organism:Homo sapiens (Human)
Description:Q9Y6Q9
Residue:1424
BDBM75541
NameBDBM75541
Synonyms:2-[[5-(2,5-dimethyl-1-phenyl-3-pyrrolyl)-1,3,4-oxadiazol-2-yl]thio]-N-[2-(trifluoromethyl)phenyl]acetamide 2-[[5-(2,5-dimethyl-1-phenyl-pyrrol-3-yl)-1,3,4-oxadiazol-2-yl]thio]-N-[2-(trifluoromethyl)phenyl]acetamide MLS000569286 cid_2368087
TypeSmall organic molecule
Emp. Form.C23H19F3N4O2S
Mol. Mass.472.483
SMILESCc1cc(c(C)n1-c1ccccc1)-c1nnc(SCC(=O)Nc2ccccc2C(F)(F)F)o1