Reaction Details
TargetTegument protein VP16
LigandBDBM87252
Substrate/Competitorn/a
Meas. Tech.Counterscreen for inhibitors of the Steroid Receptor Coactivator 3 (SRC3; NCOA3)
IC50 4834±n/a nM
Citation PubChem, PC Counterscreen for inhibitors of the Steroid Receptor Coactivator 3 (SRC3; NCOA3): Luminescence-based cell-based high throughput dose response assay to identify inhibitors of the Herpes Virus Virion Protein 16 (VP16) PubChem Bioassay(2012)[AID]
 
Tegument protein VP16
Name:Tegument protein VP16
Type:PROTEIN
Mol. Mass.:54325.13
Organism:Human herpesvirus 1 (strain 17) (HHV-1) (Human herpes simplex virus1)
Description:EBI_100271
Residue:490
BDBM87252
NameBDBM87252
Synonyms:7-Cyclopropyl-8H-imidazo[4',5':3,4]benzo[1,2-c][1,2,5]thiadiazole MLS000030244 cid_647662
TypeSmall organic molecule
Emp. Form.C10H8N4S
Mol. Mass.216.262
SMILESC1CC1c1nc2ccc3[nH]snc3c2n1