Reaction Details
TargetTegument protein VP16
LigandBDBM57102
Substrate/Competitorn/a
Meas. Tech.Counterscreen for inhibitors of the Steroid Receptor Coactivator 3 (SRC3; NCOA3)
IC50>1328±n/a nM
Citation PubChem, PC Counterscreen for inhibitors of the Steroid Receptor Coactivator 3 (SRC3; NCOA3): Luminescence-based cell-based high throughput dose response assay to identify inhibitors of the Herpes Virus Virion Protein 16 (VP16) PubChem Bioassay(2012)[AID]
 
Tegument protein VP16
Name:Tegument protein VP16
Type:PROTEIN
Mol. Mass.:54325.13
Organism:Human herpesvirus 1 (strain 17) (HHV-1) (Human herpes simplex virus1)
Description:EBI_100271
Residue:490
BDBM57102
NameBDBM57102
Synonyms:MLS000541562 N-cyclohexyl-6-phenyl-3-pyridin-2-yl-1,2,4-triazin-5-amine cid_6404647 | cyclohexyl-[6-phenyl-3-(2-pyridyl)-1,2,4-triazin-5-yl]amine
TypeSmall organic molecule
Emp. Form.C20H21N5
Mol. Mass.331.4142
SMILESC1CCC(CC1)Nc1nc(nnc1-c1ccccc1)-c1ccccn1