Reaction Details
TargetTegument protein VP16
LigandBDBM87295
Substrate/Competitorn/a
Meas. Tech.Counterscreen for inhibitors of the Steroid Receptor Coactivator 3 (SRC3; NCOA3)
IC50 6448±n/a nM
Citation PubChem, PC Counterscreen for inhibitors of the Steroid Receptor Coactivator 3 (SRC3; NCOA3): Luminescence-based cell-based high throughput dose response assay to identify inhibitors of the Herpes Virus Virion Protein 16 (VP16) PubChem Bioassay(2012)[AID]
 
Tegument protein VP16
Name:Tegument protein VP16
Type:PROTEIN
Mol. Mass.:54325.13
Organism:Human herpesvirus 1 (strain 17) (HHV-1) (Human herpes simplex virus1)
Description:EBI_100271
Residue:490
BDBM87295
NameBDBM87295
Synonyms:(4-methoxyphenyl)-(3-nitro-4-pyridyl)amine N-(4-methoxyphenyl)-3-nitro-4-pyridinamine N-(4-methoxyphenyl)-3-nitropyridin-4-amine cid_2944858
TypeSmall organic molecule
Emp. Form.C12H11N3O3
Mol. Mass.245.234
SMILESCOc1ccc(Nc2ccncc2[N+]([O-])=O)cc1