Reaction Details
TargetTegument protein VP16
LigandBDBM62115
Substrate/Competitorn/a
Meas. Tech.Counterscreen for inhibitors of the Steroid Receptor Coactivator 3 (SRC3; NCOA3)
IC50 7904±n/a nM
Citation PubChem, PC Counterscreen for inhibitors of the Steroid Receptor Coactivator 3 (SRC3; NCOA3): Luminescence-based cell-based high throughput dose response assay to identify inhibitors of the Herpes Virus Virion Protein 16 (VP16) PubChem Bioassay(2012)[AID]
 
Tegument protein VP16
Name:Tegument protein VP16
Type:PROTEIN
Mol. Mass.:54325.13
Organism:Human herpesvirus 1 (strain 17) (HHV-1) (Human herpes simplex virus1)
Description:EBI_100271
Residue:490
BDBM62115
NameBDBM62115
Synonyms:MLS000709567 N-(1,3-benzothiazol-2-yl)-2-methoxy-N-[2-(1-methylpyrrolidin-2-yl)ethyl]benzamide cid_3229425
TypeSmall organic molecule
Emp. Form.C22H25N3O2S
Mol. Mass.395.518
SMILESCOc1ccccc1C(=O)N(CCC1CCCN1C)c1nc2ccccc2s1