Reaction Details
TargetTegument protein VP16
LigandBDBM63590
Substrate/Competitorn/a
Meas. Tech.Counterscreen for inhibitors of the Steroid Receptor Coactivator 3 (SRC3; NCOA3)
IC50 7782±n/a nM
Citation PubChem, PC Counterscreen for inhibitors of the Steroid Receptor Coactivator 3 (SRC3; NCOA3): Luminescence-based cell-based high throughput dose response assay to identify inhibitors of the Herpes Virus Virion Protein 16 (VP16) PubChem Bioassay(2012)[AID]
 
Tegument protein VP16
Name:Tegument protein VP16
Type:PROTEIN
Mol. Mass.:54325.13
Organism:Human herpesvirus 1 (strain 17) (HHV-1) (Human herpes simplex virus1)
Description:EBI_100271
Residue:490
BDBM63590
NameBDBM63590
Synonyms:MLS000419595 N-(6,7-dihydro-[1,4]dioxino[2,3-f][1,3]benzothiazol-2-yl)-2,3-dihydro-1,4-dioxine-5-carboxamide SMR000320312 | cid_7203047
TypeSmall organic molecule
Emp. Form.C14H12N2O5S
Mol. Mass.320.32
SMILESO=C(Nc1nc2cc3OCCOc3cc2s1)C1=COCCO1