Reaction Details
TargetTegument protein VP16
LigandBDBM87314
Substrate/Competitorn/a
Meas. Tech.Counterscreen for inhibitors of the Steroid Receptor Coactivator 3 (SRC3; NCOA3)
IC50 6040±n/a nM
Citation PubChem, PC Counterscreen for inhibitors of the Steroid Receptor Coactivator 3 (SRC3; NCOA3): Luminescence-based cell-based high throughput dose response assay to identify inhibitors of the Herpes Virus Virion Protein 16 (VP16) PubChem Bioassay(2012)[AID]
 
Tegument protein VP16
Name:Tegument protein VP16
Type:PROTEIN
Mol. Mass.:54325.13
Organism:Human herpesvirus 1 (strain 17) (HHV-1) (Human herpes simplex virus1)
Description:EBI_100271
Residue:490
BDBM87314
NameBDBM87314
Synonyms:MLS000776402 N'-[(Z)-[5-(hydroxymethyl)-2-methyl-3-oxidanylidene-pyridin-4-ylidene]methyl]-4,5,6,7-tetrahydro-1-benzothiophene-2-carbohydrazide N'-[(Z)-[5-(hydroxymethyl)-2-methyl-3-oxopyridin-4-ylidene]methyl]-4,5,6,7-tetrahydro-1-benzothiophene-2-carbohydrazide cid_6072154
TypeSmall organic molecule
Emp. Form.C17H19N3O3S
Mol. Mass.345.416
SMILESCc1ncc(C=O)c(CNNC(=O)c2cc3CCCCc3s2)c1O