Reaction Details
TargetTegument protein VP16
LigandBDBM87336
Substrate/Competitorn/a
Meas. Tech.Counterscreen for inhibitors of the Steroid Receptor Coactivator 3 (SRC3; NCOA3)
IC50 6040±n/a nM
Citation PubChem, PC Counterscreen for inhibitors of the Steroid Receptor Coactivator 3 (SRC3; NCOA3): Luminescence-based cell-based high throughput dose response assay to identify inhibitors of the Herpes Virus Virion Protein 16 (VP16) PubChem Bioassay(2012)[AID]
 
Tegument protein VP16
Name:Tegument protein VP16
Type:PROTEIN
Mol. Mass.:54325.13
Organism:Human herpesvirus 1 (strain 17) (HHV-1) (Human herpes simplex virus1)
Description:EBI_100271
Residue:490
BDBM87336
NameBDBM87336
Synonyms:(6E)-3-methoxy-6-[4-(4-methoxyphenyl)-1,2-dihydropyrazol-3-ylidene]-1-cyclohexa-2,4-dienone (6E)-3-methoxy-6-[4-(4-methoxyphenyl)-3-pyrazolin-3-ylidene]cyclohexa-2,4-dien-1-one SMR000543396 | cid_24747689
TypeSmall organic molecule
Emp. Form.C17H16N2O3
Mol. Mass.296.3205
SMILESCOc1ccc(cc1)-c1c[nH]nc1-c1ccc(OC)cc1O