Reaction Details
TargetNuclear receptor coactivator 1
LigandBDBM32271
Substrate/Competitorn/a
Meas. Tech.Counterscreen for inhibitors of the Steroid Receptor Coactivator 3 (SRC3; NCOA3)
IC50 3293±n/a nM
Citation PubChem, PC Counterscreen for inhibitors of the Steroid Receptor Coactivator 3 (SRC3; NCOA3): Luminescence-based cell-based high throughput dose response assay to identify inhibitors of the Steroid Receptor Coactivator 1 (SRC1; NCOA1) PubChem Bioassay(2012)[AID]
 
Nuclear receptor coactivator 1
Name:Nuclear receptor coactivator 1
Type:PROTEIN
Mol. Mass.:156749.34
Organism:Homo sapiens (Human)
Description:ChEMBL_759690
Residue:1441
BDBM32271
NameBDBM32271
Synonyms:3-amino-4-(2-furyl)-6,7-dihydro-5H-cyclopenta[b]thieno[3,2-e]pyridine-2-carboxamide SMR000073423 | cid_893110
TypeSmall organic molecule
Emp. Form.C15H13N3O2S
Mol. Mass.299.348
SMILESNC(=O)c1sc2nc3CCCc3c(-c3ccco3)c2c1N