Reaction Details
TargetNuclear receptor coactivator 1
LigandBDBM87294
Substrate/Competitorn/a
Meas. Tech.Counterscreen for inhibitors of the Steroid Receptor Coactivator 3 (SRC3; NCOA3)
IC50 4278±n/a nM
Citation PubChem, PC Counterscreen for inhibitors of the Steroid Receptor Coactivator 3 (SRC3; NCOA3): Luminescence-based cell-based high throughput dose response assay to identify inhibitors of the Steroid Receptor Coactivator 1 (SRC1; NCOA1) PubChem Bioassay(2012)[AID]
 
Nuclear receptor coactivator 1
Name:Nuclear receptor coactivator 1
Type:PROTEIN
Mol. Mass.:156749.34
Organism:Homo sapiens (Human)
Description:ChEMBL_759690
Residue:1441
BDBM87294
NameBDBM87294
Synonyms:MLS000729024 N-[4-[2-(3,4-diethoxyphenyl)ethanoylamino]phenyl]furan-2-carboxamide N-[4-[[2-(3,4-diethoxyphenyl)acetyl]amino]phenyl]-2-furamide SMR000307302 | cid_1503622
TypeSmall organic molecule
Emp. Form.C23H24N2O5
Mol. Mass.408.4471
SMILESCCOc1ccc(CC(=O)Nc2ccc(NC(=O)c3ccco3)cc2)cc1OCC