Reaction Details
TargetNuclear receptor coactivator 1
LigandBDBM77578
Substrate/Competitorn/a
Meas. Tech.Counterscreen for inhibitors of the Steroid Receptor Coactivator 3 (SRC3; NCOA3)
IC50 6031±n/a nM
Citation PubChem, PC Counterscreen for inhibitors of the Steroid Receptor Coactivator 3 (SRC3; NCOA3): Luminescence-based cell-based high throughput dose response assay to identify inhibitors of the Steroid Receptor Coactivator 1 (SRC1; NCOA1) PubChem Bioassay(2012)[AID]
 
Nuclear receptor coactivator 1
Name:Nuclear receptor coactivator 1
Type:PROTEIN
Mol. Mass.:156749.34
Organism:Homo sapiens (Human)
Description:ChEMBL_759690
Residue:1441
BDBM77578
NameBDBM77578
Synonyms:MLS001211345 N-[(2,4-dichlorophenyl)-(8-hydroxy-7-quinolinyl)methyl]butanamide N-[(2,4-dichlorophenyl)-(8-hydroxyquinolin-7-yl)methyl]butanamide SMR000517131 | cid_2921215
TypeSmall organic molecule
Emp. Form.C20H18Cl2N2O2
Mol. Mass.389.275
SMILESCCCC(=O)NC(c1ccc(Cl)cc1Cl)c1ccc2cccnc2c1O