Reaction Details
TargetHigh affinity choline transporter 1
LigandBDBM87580
Substrate/Competitorn/a
Meas. Tech.JHICC_CHT_Inh_3H uptake_CRC
IC50 8421.798897±n/a nM
Citation PubChem, PC JHICC_CHT_Inh_3H uptake_CRC PubChem Bioassay(2012)[AID]
 
High affinity choline transporter 1
Name:High affinity choline transporter 1
Type:PROTEIN
Mol. Mass.:63194.33
Organism:Homo sapiens (Human)
Description:ChEMBL_1464247
Residue:580
BDBM87580
NameBDBM87580
Synonyms:3-(benzylsulfamoyl)-N-(4-methylcyclohexyl)benzamide N-(4-methylcyclohexyl)-3-[(phenylmethyl)sulfamoyl]benzamide cid_18106490
TypeSmall organic molecule
Emp. Form.C21H26N2O3S
Mol. Mass.386.508
SMILESCC1CCC(CC1)NC(=O)c1cccc(c1)S(=O)(=O)NCc1ccccc1