Reaction Details
TargetNuclear receptor coactivator 3
LigandBDBM70761
Substrate/Competitorn/a
Meas. Tech.Counterscreen for inhibitors of the Steroid Receptor Coactivator 1 (SRC1; NCOA1)
IC50 503.09±n/a nM
Citation PubChem, PC Counterscreen for inhibitors of the Steroid Receptor Coactivator 1 (SRC1; NCOA1): Luminescence-based cell-based high throughput dose response assay to identify inhibitors of the Steroid Receptor Coactivator 3 (SRC3; NCOA3) PubChem Bioassay(2012)[AID]
 
Nuclear receptor coactivator 3
Name:Nuclear receptor coactivator 3
Type:Enzyme Catalytic Domain
Mol. Mass.:155305.29
Organism:Homo sapiens (Human)
Description:Q9Y6Q9
Residue:1424
BDBM70761
NameBDBM70761
Synonyms:2-(3-chloro-N-(2-chloro-1-oxoethyl)anilino)-N-cyclohexyl-2-(3-pyridinyl)acetamide 2-(3-chloro-N-(2-chloroacetyl)anilino)-N-cyclohexyl-2-pyridin-3-ylacetamide 2-[2-chloranylethanoyl-(3-chlorophenyl)amino]-N-cyclohexyl-2-pyridin-3-yl-ethanamide SMR000206939 | cid_4381127
TypeSmall organic molecule
Emp. Form.C21H23Cl2N3O2
Mol. Mass.420.332
SMILESClCC(=O)N(C(C(=O)NC1CCCCC1)c1cccnc1)c1cccc(Cl)c1