Reaction Details
TargetNuclear receptor coactivator 3
LigandBDBM54272
Substrate/Competitorn/a
Meas. Tech.Counterscreen for inhibitors of the Steroid Receptor Coactivator 1 (SRC1; NCOA1)
IC50 694.34±n/a nM
Citation PubChem, PC Counterscreen for inhibitors of the Steroid Receptor Coactivator 1 (SRC1; NCOA1): Luminescence-based cell-based high throughput dose response assay to identify inhibitors of the Steroid Receptor Coactivator 3 (SRC3; NCOA3) PubChem Bioassay(2012)[AID]
 
Nuclear receptor coactivator 3
Name:Nuclear receptor coactivator 3
Type:Enzyme Catalytic Domain
Mol. Mass.:155305.29
Organism:Homo sapiens (Human)
Description:Q9Y6Q9
Residue:1424
BDBM54272
NameBDBM54272
Synonyms:2-chloranyl-1-[5-(furan-2-yl)-3-thiophen-2-yl-3,4-dihydropyrazol-2-yl]ethanone 2-chloro-1-[5-(2-furanyl)-3-thiophen-2-yl-3,4-dihydropyrazol-2-yl]ethanone MLS000336271 acs.jmedchem.1c00409_ST.392 | cid_4961662
TypeSmall organic molecule
Emp. Form.C13H11ClN2O2S
Mol. Mass.294.757
SMILESClCC(=O)N1N=C(CC1c1cccs1)c1ccco1