Reaction Details
TargetNuclear receptor coactivator 3
LigandBDBM5925
Substrate/Competitorn/a
Meas. Tech.Counterscreen for inhibitors of the Steroid Receptor Coactivator 1 (SRC1; NCOA1)
IC50 2634±n/a nM
Citation PubChem, PC Counterscreen for inhibitors of the Steroid Receptor Coactivator 1 (SRC1; NCOA1): Luminescence-based cell-based high throughput dose response assay to identify inhibitors of the Steroid Receptor Coactivator 3 (SRC3; NCOA3) PubChem Bioassay(2012)[AID]
 
Nuclear receptor coactivator 3
Name:Nuclear receptor coactivator 3
Type:Enzyme Catalytic Domain
Mol. Mass.:155305.29
Organism:Homo sapiens (Human)
Description:Q9Y6Q9
Residue:1424
BDBM5925
NameBDBM5925
Synonyms:cid_699688
Typen/a
Emp. Form.C18H17N3O2S
Mol. Mass.339.411
SMILESCc1nc2sc(C(N)=O)c(N)c2c(C)c1CC(=O)c1ccccc1