Reaction Details
TargetNuclear receptor coactivator 3
LigandBDBM6761
Substrate/Competitorn/a
Meas. Tech.Counterscreen for inhibitors of the Steroid Receptor Coactivator 1 (SRC1; NCOA1)
IC50 2621±n/a nM
Citation PubChem, PC Counterscreen for inhibitors of the Steroid Receptor Coactivator 1 (SRC1; NCOA1): Luminescence-based cell-based high throughput dose response assay to identify inhibitors of the Steroid Receptor Coactivator 3 (SRC3; NCOA3) PubChem Bioassay(2012)[AID]
 
Nuclear receptor coactivator 3
Name:Nuclear receptor coactivator 3
Type:Enzyme Catalytic Domain
Mol. Mass.:155305.29
Organism:Homo sapiens (Human)
Description:Q9Y6Q9
Residue:1424
BDBM6761
NameBDBM6761
Synonyms:cid_4416225
Typen/a
Emp. Form.C13H13F3N2O4
Mol. Mass.318.2485
SMILESCOc1cc2C(CNC(=O)c2cc1OC)NC(=O)C(F)(F)F