Reaction Details
TargetNuclear receptor coactivator 3
LigandBDBM87583
Substrate/Competitorn/a
Meas. Tech.Counterscreen for inhibitors of the Steroid Receptor Coactivator 1 (SRC1; NCOA1)
IC50 2090±n/a nM
Citation PubChem, PC Counterscreen for inhibitors of the Steroid Receptor Coactivator 1 (SRC1; NCOA1): Luminescence-based cell-based high throughput dose response assay to identify inhibitors of the Steroid Receptor Coactivator 3 (SRC3; NCOA3) PubChem Bioassay(2012)[AID]
 
Nuclear receptor coactivator 3
Name:Nuclear receptor coactivator 3
Type:Enzyme Catalytic Domain
Mol. Mass.:155305.29
Organism:Homo sapiens (Human)
Description:Q9Y6Q9
Residue:1424
BDBM87583
NameBDBM87583
Synonyms:1-N-(6-bromoquinazolin-4-yl)-4-N,4-N-dimethylbenzene-1,4-diamine N-(6-Bromo-quinazolin-4-yl)-N',N'-dimethyl-benzene-1,4-diamine N1-(6-bromo-4-quinazolinyl)-N4,N4-dimethylbenzene-1,4-diamine [4-[(6-bromoquinazolin-4-yl)amino]phenyl]-dimethyl-amine | cid_702724
TypeSmall organic molecule
Emp. Form.C16H15BrN4
Mol. Mass.343.221
SMILESCN(C)c1ccc(Nc2ncnc3ccc(Br)cc23)cc1