Reaction Details
TargetNuclear receptor coactivator 1
LigandBDBM70761
Substrate/Competitorn/a
Meas. Tech.Luminescence-based cell-based high throughput dose response assay for inhibitors of the Steroid Receptor Coactivator 1 (SRC1; NCOA1)
IC50 6913±n/a nM
Citation PubChem, PC Luminescence-based cell-based high throughput dose response assay for inhibitors of the Steroid Receptor Coactivator 1 (SRC1; NCOA1) PubChem Bioassay(2012)[AID]
 
Nuclear receptor coactivator 1
Name:Nuclear receptor coactivator 1
Type:PROTEIN
Mol. Mass.:156749.34
Organism:Homo sapiens (Human)
Description:ChEMBL_759690
Residue:1441
BDBM70761
NameBDBM70761
Synonyms:2-(3-chloro-N-(2-chloro-1-oxoethyl)anilino)-N-cyclohexyl-2-(3-pyridinyl)acetamide 2-(3-chloro-N-(2-chloroacetyl)anilino)-N-cyclohexyl-2-pyridin-3-ylacetamide 2-[2-chloranylethanoyl-(3-chlorophenyl)amino]-N-cyclohexyl-2-pyridin-3-yl-ethanamide SMR000206939 | cid_4381127
TypeSmall organic molecule
Emp. Form.C21H23Cl2N3O2
Mol. Mass.420.332
SMILESClCC(=O)N(C(C(=O)NC1CCCCC1)c1cccnc1)c1cccc(Cl)c1