Reaction Details
TargetNuclear receptor coactivator 1
LigandBDBM54272
Substrate/Competitorn/a
Meas. Tech.Luminescence-based cell-based high throughput dose response assay for inhibitors of the Steroid Receptor Coactivator 1 (SRC1; NCOA1)
IC50>443.14±n/a nM
Citation PubChem, PC Luminescence-based cell-based high throughput dose response assay for inhibitors of the Steroid Receptor Coactivator 1 (SRC1; NCOA1) PubChem Bioassay(2012)[AID]
 
Nuclear receptor coactivator 1
Name:Nuclear receptor coactivator 1
Type:PROTEIN
Mol. Mass.:156749.34
Organism:Homo sapiens (Human)
Description:ChEMBL_759690
Residue:1441
BDBM54272
NameBDBM54272
Synonyms:2-chloranyl-1-[5-(furan-2-yl)-3-thiophen-2-yl-3,4-dihydropyrazol-2-yl]ethanone 2-chloro-1-[5-(2-furanyl)-3-thiophen-2-yl-3,4-dihydropyrazol-2-yl]ethanone MLS000336271 acs.jmedchem.1c00409_ST.392 | cid_4961662
TypeSmall organic molecule
Emp. Form.C13H11ClN2O2S
Mol. Mass.294.757
SMILESClCC(=O)N1N=C(CC1c1cccs1)c1ccco1