Reaction Details
TargetNuclear receptor coactivator 1
LigandBDBM69148
Substrate/Competitorn/a
Meas. Tech.Luminescence-based cell-based high throughput dose response assay for inhibitors of the Steroid Receptor Coactivator 1 (SRC1; NCOA1)
IC50 6060±n/a nM
Citation PubChem, PC Luminescence-based cell-based high throughput dose response assay for inhibitors of the Steroid Receptor Coactivator 1 (SRC1; NCOA1) PubChem Bioassay(2012)[AID]
 
Nuclear receptor coactivator 1
Name:Nuclear receptor coactivator 1
Type:PROTEIN
Mol. Mass.:156749.34
Organism:Homo sapiens (Human)
Description:ChEMBL_759690
Residue:1441
BDBM69148
NameBDBM69148
Synonyms:2-[(4-fluorobenzyl)thio]-5-(4-pyridyl)-1,3,4-oxadiazole 2-[(4-fluorophenyl)methylthio]-5-pyridin-4-yl-1,3,4-oxadiazole MLS000675386 cid_975378
TypeSmall organic molecule
Emp. Form.C14H10FN3OS
Mol. Mass.287.312
SMILESFc1ccc(CSc2nnc(o2)-c2ccncc2)cc1