Reaction Details
TargetNuclear receptor coactivator 1
LigandBDBM6508
Substrate/Competitorn/a
Meas. Tech.Luminescence-based cell-based high throughput dose response assay for inhibitors of the Steroid Receptor Coactivator 1 (SRC1; NCOA1)
IC50 3871±n/a nM
Citation PubChem, PC Luminescence-based cell-based high throughput dose response assay for inhibitors of the Steroid Receptor Coactivator 1 (SRC1; NCOA1) PubChem Bioassay(2012)[AID]
 
Nuclear receptor coactivator 1
Name:Nuclear receptor coactivator 1
Type:PROTEIN
Mol. Mass.:156749.34
Organism:Homo sapiens (Human)
Description:ChEMBL_759690
Residue:1441
BDBM6508
NameBDBM6508
Synonyms:cid_1150831
Typen/a
Emp. Form.C21H25N3O2
Mol. Mass.351.4421
SMILESO=C(CCC1CCCC1)Nc1ccc(cc1)C(=O)NCc1cccnc1