Reaction Details
TargetNuclear receptor coactivator 1
LigandBDBM87320
Substrate/Competitorn/a
Meas. Tech.Luminescence-based cell-based high throughput dose response assay for inhibitors of the Steroid Receptor Coactivator 1 (SRC1; NCOA1)
IC50 8080±n/a nM
Citation PubChem, PC Luminescence-based cell-based high throughput dose response assay for inhibitors of the Steroid Receptor Coactivator 1 (SRC1; NCOA1) PubChem Bioassay(2012)[AID]
 
Nuclear receptor coactivator 1
Name:Nuclear receptor coactivator 1
Type:PROTEIN
Mol. Mass.:156749.34
Organism:Homo sapiens (Human)
Description:ChEMBL_759690
Residue:1441
BDBM87320
NameBDBM87320
Synonyms:(2S)-2-amino-N-[(E)-(4-keto-6-methyl-chromen-3-yl)methyleneamino]-3-phenyl-propionamide;hydrochloride (2S)-2-amino-N-[(E)-(6-methyl-4-oxochromen-3-yl)methylideneamino]-3-phenylpropanamide;hydrochloride (S)-2-Amino-3-phenyl-propionic acid [1-(6-methyl-4-oxo-4H-chromen-3-yl)-meth-(E)-ylidene]-hydrazide SMR000438045 | cid_52994974
TypeSmall organic molecule
Emp. Form.C20H19N3O3
Mol. Mass.349.3832
SMILESCc1ccc2occ(\C=N\NC(=O)[C@@H](N)Cc3ccccc3)c(=O)c2c1