Reaction Details
TargetTyrosine-protein phosphatase non-receptor type 11
LigandBDBM46222
Substrate/Competitorn/a
Meas. Tech.Dose Response selectivity of inhibitors of Striatal-Enriched Phosphatase (STEP) in a SHP2 (PTPN11) Inhibition Assay
IC50 676±n/a nM
Citation PubChem, PC Dose Response selectivity of inhibitors of Striatal-Enriched Phosphatase (STEP) in a SHP2 (PTPN11) Inhibition Assay PubChem Bioassay(2012)[AID]
 
Tyrosine-protein phosphatase non-receptor type 11
Name:Tyrosine-protein phosphatase non-receptor type 11
Type:Protein phosphatase
Mol. Mass.:68443.59
Organism:Homo sapiens (Human)
Description:Q06124
Residue:597
BDBM46222
NameBDBM46222
Synonyms:3-(3-chloranyl-4-methoxy-phenyl)-1-(3-methylbutyl)-1-(1-propan-2-ylpiperidin-4-yl)thiourea 3-(3-chloro-4-methoxyphenyl)-1-(3-methylbutyl)-1-(1-propan-2-yl-4-piperidinyl)thiourea MLS-0330044.0001 | cid_24761488
TypeSmall organic molecule
Emp. Form.C21H34ClN3OS
Mol. Mass.412.032
SMILESCOc1ccc(NC(=S)N(CCC(C)C)C2CCN(CC2)C(C)C)cc1Cl