Reaction Details
Target26S proteasome non-ATPase regulatory subunit 14
LigandBDBM46246
Substrate/Competitorn/a
Meas. Tech.Dose response confirmation of uHTS RPN11 inhibitor hits in a Fluorescence Polarization assay
IC50 5260±752 nM
Citation PubChem, PC Dose response confirmation of uHTS RPN11 inhibitor hits in a Fluorescence Polarization assay PubChem Bioassay(2012)[AID]
 
26S proteasome non-ATPase regulatory subunit 14
Name:26S proteasome non-ATPase regulatory subunit 14
Type:Protein
Mol. Mass.:34576.68
Organism:Homo sapiens (Human)
Description:O00487
Residue:310
BDBM46246
NameBDBM46246
Synonyms:4-[(5Z)-5-[[5-(1,3-benzothiazol-2-yl)-2-furanyl]methylidene]-4-oxo-2-sulfanylidene-3-thiazolidinyl]butanoic acid 4-[(5Z)-5-[[5-(1,3-benzothiazol-2-yl)furan-2-yl]methylidene]-4-oxidanylidene-2-sulfanylidene-1,3-thiazolidin-3-yl]butanoic acid MLS-0109411.0001 cid_2012947
TypeSmall organic molecule
Emp. Form.C19H14N2O4S3
Mol. Mass.430.52
SMILESOC(=O)CCCN1C(=S)S\C(=C/c2ccc(o2)-c2nc3ccccc3s2)C1=O