Reaction Details
Target26S proteasome non-ATPase regulatory subunit 14
LigandBDBM88845
Substrate/Competitorn/a
Meas. Tech.Dose response confirmation of uHTS RPN11 inhibitor hits in a Fluorescence Polarization assay
IC50 3790±163 nM
Citation PubChem, PC Dose response confirmation of uHTS RPN11 inhibitor hits in a Fluorescence Polarization assay PubChem Bioassay(2012)[AID]
 
26S proteasome non-ATPase regulatory subunit 14
Name:26S proteasome non-ATPase regulatory subunit 14
Type:Protein
Mol. Mass.:34576.68
Organism:Homo sapiens (Human)
Description:O00487
Residue:310
BDBM88845
NameBDBM88845
Synonyms:MLS000558818 N-(1,3-benzothiazol-2-yl)-2-[(5-tert-butyl-[1,2,4]triazolo[4,3-c]quinazolin-3-yl)sulfanyl]ethanamide N-Benzothiazol-2-yl-2-(5-tert-butyl-[1,2,4]triazolo[4,3-c]quinazolin-3-ylsulfanyl)-acetamide cid_3227435
TypeSmall organic molecule
Emp. Form.C22H20N6OS2
Mol. Mass.448.564
SMILESCC(C)(C)c1nc2ccccc2c2nnc(SCC(=O)Nc3nc4ccccc4s3)n12