Reaction Details
Target26S proteasome non-ATPase regulatory subunit 14
LigandBDBM83086
Substrate/Competitorn/a
Meas. Tech.Dose response confirmation of uHTS RPN11 inhibitor hits in a Fluorescence Polarization assay
IC50 7120±405 nM
Citation PubChem, PC Dose response confirmation of uHTS RPN11 inhibitor hits in a Fluorescence Polarization assay PubChem Bioassay(2012)[AID]
 
26S proteasome non-ATPase regulatory subunit 14
Name:26S proteasome non-ATPase regulatory subunit 14
Type:Protein
Mol. Mass.:34576.68
Organism:Homo sapiens (Human)
Description:O00487
Residue:310
BDBM83086
NameBDBM83086
Synonyms:MLS001156641 N-[2-(2,3-dimethylanilino)-2-oxoethyl]-3-(4-oxo-5,6,7,8-tetrahydro-3H-[1]benzothiolo[2,3-d]pyrimidin-2-yl)propanamide SMR000715822 | cid_24980803
TypeSmall organic molecule
Emp. Form.C23H26N4O3S
Mol. Mass.438.543
SMILESCc1cccc(NC(=O)CNC(=O)CCc2nc3sc4CCCCc4c3c(=O)[nH]2)c1C