Reaction Details
Target26S proteasome non-ATPase regulatory subunit 14
LigandBDBM89023
Substrate/Competitorn/a
Meas. Tech.Dose response confirmation of uHTS RPN11 inhibitor hits in a Fluorescence Polarization assay
IC50 7920±482 nM
Citation PubChem, PC Dose response confirmation of uHTS RPN11 inhibitor hits in a Fluorescence Polarization assay PubChem Bioassay(2012)[AID]
 
26S proteasome non-ATPase regulatory subunit 14
Name:26S proteasome non-ATPase regulatory subunit 14
Type:Protein
Mol. Mass.:34576.68
Organism:Homo sapiens (Human)
Description:O00487
Residue:310
BDBM89023
NameBDBM89023
Synonyms:6-[(5Z)-4-keto-5-[[1-phenyl-3-(2-thienyl)pyrazol-4-yl]methylene]-2-thioxo-thiazolidin-3-yl]hexanoic acid 6-[(5Z)-4-oxo-5-[(1-phenyl-3-thiophen-2-yl-4-pyrazolyl)methylidene]-2-sulfanylidene-3-thiazolidinyl]hexanoic acid MLS002633376 cid_1632449
TypeSmall organic molecule
Emp. Form.C23H21N3O3S3
Mol. Mass.483.626
SMILESOC(=O)CCCCCN1C(=S)S\C(=C/c2cn(nc2-c2cccs2)-c2ccccc2)C1=O