Reaction Details
TargetProthrombin
LigandBDBM54791
Substrate/Competitorn/a
Meas. Tech.Dose Response validation of uHTS RPN11 inhibitor hits using a Thrombin Fluorescence Polarization assay
IC50 30200±4450 nM
Citation PubChem, PC Dose Response validation of uHTS RPN11 inhibitor hits using a Thrombin Fluorescence Polarization assay PubChem Bioassay(2012)[AID]
 
Prothrombin
Name:Prothrombin
Type:Enzyme
Mol. Mass.:70502.73
Organism:Bos taurus (Bovine)
Description:P00735
Residue:625
BDBM54791
NameBDBM54791
Synonyms:5-chloranyl-2-methoxy-N-[3-([1,2,4]triazolo[4,3-b]pyridazin-6-yl)phenyl]benzamide MLS000685766 cid_7217786
TypeSmall organic molecule
Emp. Form.C19H14ClN5O2
Mol. Mass.379.8
SMILESCOc1ccc(Cl)cc1C(=O)Nc1cccc(c1)-c1ccc2nncn2n1