Reaction Details
TargetProthrombin
LigandBDBM4304
Substrate/Competitorn/a
Meas. Tech.Dose Response validation of uHTS RPN11 inhibitor hits using a Thrombin Fluorescence Polarization assay
IC50 67900±26200 nM
Citation PubChem, PC Dose Response validation of uHTS RPN11 inhibitor hits using a Thrombin Fluorescence Polarization assay PubChem Bioassay(2012)[AID]
 
Prothrombin
Name:Prothrombin
Type:Enzyme
Mol. Mass.:70502.73
Organism:Bos taurus (Bovine)
Description:P00735
Residue:625
BDBM4304
NameBDBM4304
Synonyms:(2E)-2-cyano-3-(3,4-dihydroxyphenyl)-N-phenylprop-2-enamide cid_5328771 | tyrphostin 1
TypeSmall organic molecule
Emp. Form.C16H12N2O3
Mol. Mass.280.2781
SMILESOc1ccc(\C=C(/C#N)C(=O)Nc2ccccc2)cc1O