Reaction Details
TargetIsocitrate dehydrogenase [NADP] cytoplasmic [R132C]
LigandBDBM278540
Substrate/Competitorn/a
Meas. Tech.Inhibitory Activity Against IDH1R132H and IDH1R132C Enzymes
pH7.5±n/a
Temperature298.15±n/a K
IC50 47±n/a nM
Commentsextracted
Citation Saito, SItoh, MFujisawa, TSaito, HKiyotsuka, YWatanabe, HMatsunaga, HKagoshima, YSuzuki, TOgawara, YKitabayashi, K Isoxazole derivative as mutant isocitrate dehydrogenase 1 inhibitor US Patent US10040791 Publication Date 8/7/2018
 
Isocitrate dehydrogenase [NADP] cytoplasmic [R132C]
Name:Isocitrate dehydrogenase [NADP] cytoplasmic [R132C]
Type:Enzyme Catalytic Domain
Mol. Mass.:46607.23
Organism:Homo sapiens (Human)
Description:O75874[R132C]
Residue:414
BDBM278540
NameBDBM278540
Synonyms: (2E)-3-(3-Methyl-1-{[5-(3-methyloxetan-3-yl)-3-(2,4,6-trichlorophenyl)-1,2-oxazol-4-yl]carbonyl}-1H-indol-4-yl)prop-2-enoic acid | US10040791, Example 2
TypeSmall organic molecule
Emp. Form.C26H19Cl3N2O5
Mol. Mass.545.798
SMILESCc1cn(C(=O)c2c(noc2C2(C)COC2)-c2c(Cl)cc(Cl)cc2Cl)c2cccc(\C=C\C(O)=O)c12