Reaction Details
TargetDual specificity protein phosphatase 3
LigandBDBM88776
Substrate/Competitorn/a
Meas. Tech.Dose Response selectivity of inhibitors of STriatal-Enriched Phosphatase (STEP) in the dual-specificity protein-tyrosine phosphatase VHR Inhibition Assay
IC50 3020±n/a nM
Citation PubChem, PC Dose Response selectivity of inhibitors of STriatal-Enriched Phosphatase (STEP) in the dual-specificity protein-tyrosine phosphatase VHR Inhibition Assay PubChem Bioassay(2012)[AID]
 
Dual specificity protein phosphatase 3
Name:Dual specificity protein phosphatase 3
Type:Hydrolase
Mol. Mass.:20480.58
Organism:Homo sapiens (Human)
Description:n/a
Residue:185
BDBM88776
NameBDBM88776
Synonyms:2-[4-[(Z)-[5-(4-chlorophenyl)-6-isopropoxycarbonyl-3-keto-7-methyl-5H-thiazolo[3,2-a]pyrimidin-2-ylidene]methyl]phenoxy]acetic acid 2-[4-[(Z)-[5-(4-chlorophenyl)-7-methyl-3-oxo-6-[oxo(propan-2-yloxy)methyl]-5H-thiazolo[3,2-a]pyrimidin-2-ylidene]methyl]phenoxy]acetic acid MLS001178474 cid_5777336 | {4-[(5-(4-chlorophenyl)-6-(isopropoxycarbonyl)-7-methyl-3-oxo-5H-[1,3]thiazolo[3,2-a]pyrimidin-2(3H)-ylidene)methyl]phenoxy}acetic acid
TypeSmall organic molecule
Emp. Form.C26H23ClN2O6S
Mol. Mass.526.989
SMILESCC(C)OC(=O)C1=C(C)N=c2s\c(=C/c3ccc(OCC(O)=O)cc3)c(=O)n2C1c1ccc(Cl)cc1