Reaction Details
TargetHigh affinity choline transporter 1
LigandBDBM38882
Substrate/Competitorn/a
Meas. Tech.Dose responses of compounds that activate the Choline Transporter (CHT) - 10 point CRC
EC50 22150±n/a nM
Citation PubChem, PC Dose responses of compounds that activate the Choline Transporter (CHT) - 10 point CRC PubChem Bioassay(2012)[AID]
 
High affinity choline transporter 1
Name:High affinity choline transporter 1
Type:PROTEIN
Mol. Mass.:63194.33
Organism:Homo sapiens (Human)
Description:ChEMBL_1464247
Residue:580
BDBM38882
NameBDBM38882
Synonyms:MLS000079343 N-(2,5-dimethoxyphenyl)-4-(2-oxidanylidenepyrrolidin-1-yl)benzenesulfonamide N-(2,5-dimethoxyphenyl)-4-(2-oxopyrrolidin-1-yl)benzenesulfonamide cid_658276
TypeSmall organic molecule
Emp. Form.C18H20N2O5S
Mol. Mass.376.427
SMILESCOc1ccc(OC)c(NS(=O)(=O)c2ccc(cc2)N2CCCC2=O)c1