Reaction Details
TargetHigh affinity choline transporter 1
LigandBDBM42511
Substrate/Competitorn/a
Meas. Tech.Dose responses of compounds that activate the Choline Transporter (CHT) - 10 point CRC
EC50 14340±n/a nM
Citation PubChem, PC Dose responses of compounds that activate the Choline Transporter (CHT) - 10 point CRC PubChem Bioassay(2012)[AID]
 
High affinity choline transporter 1
Name:High affinity choline transporter 1
Type:PROTEIN
Mol. Mass.:63194.33
Organism:Homo sapiens (Human)
Description:ChEMBL_1464247
Residue:580
BDBM42511
NameBDBM42511
Synonyms:(6-Bromo-2-ethyl-4-phenyl-4H-quinazolin-3-yl)-acetic acid methyl ester MLS000560994 cid_2862130 methyl 2-(6-bromo-2-ethyl-4-phenyl-4H-quinazolin-3-yl)acetate
TypeSmall organic molecule
Emp. Form.C19H19BrN2O2
Mol. Mass.387.27
SMILESCCC1=Nc2ccc(Br)cc2C(N1CC(=O)OC)c1ccccc1