Reaction Details
TargetHigh affinity choline transporter 1
LigandBDBM89146
Substrate/Competitorn/a
Meas. Tech.Dose responses of compounds that activate the Choline Transporter (CHT) - 10 point CRC
EC50 6830±n/a nM
Citation PubChem, PC Dose responses of compounds that activate the Choline Transporter (CHT) - 10 point CRC PubChem Bioassay(2012)[AID]
 
High affinity choline transporter 1
Name:High affinity choline transporter 1
Type:PROTEIN
Mol. Mass.:63194.33
Organism:Homo sapiens (Human)
Description:ChEMBL_1464247
Residue:580
BDBM89146
NameBDBM89146
Synonyms:1-phenyl-2-p-phenetyl-6,7,8,9-tetrahydro-5H-imidaz[1,2-a]azepin-4-ium;bromide 2-(4-ethoxyphenyl)-1-phenyl-6,7,8,9-tetrahydro-5H-imidazo[1,2-a]azepin-4-ium;bromide SMR000211545 | cid_12005540
TypeSmall organic molecule
Emp. Form.C22H25N2O
Mol. Mass.333.4462
SMILESCCOc1ccc(cc1)-c1c[n+]2CCCCCc2n1-c1ccccc1