Reaction Details
TargetHigh affinity choline transporter 1
LigandBDBM89152
Substrate/Competitorn/a
Meas. Tech.Dose responses of compounds that activate the Choline Transporter (CHT) - 10 point CRC
EC50 12170±n/a nM
Citation PubChem, PC Dose responses of compounds that activate the Choline Transporter (CHT) - 10 point CRC PubChem Bioassay(2012)[AID]
 
High affinity choline transporter 1
Name:High affinity choline transporter 1
Type:PROTEIN
Mol. Mass.:63194.33
Organism:Homo sapiens (Human)
Description:ChEMBL_1464247
Residue:580
BDBM89152
NameBDBM89152
Synonyms:MLS000662777 SMR000270232 cid_2910572 | diisobutyl [anilino(4-fluorophenyl)methyl]phosphonate
TypeSmall organic molecule
Emp. Form.C21H29FNO3P
Mol. Mass.393.432
SMILESCC(C)COP(=O)(OCC(C)C)C(Nc1ccccc1)c1ccc(F)cc1