Reaction Details
TargetHigh affinity choline transporter 1
LigandBDBM78811
Substrate/Competitorn/a
Meas. Tech.Dose responses of compounds that activate the Choline Transporter (CHT) - 10 point CRC
EC50 22020±n/a nM
Citation PubChem, PC Dose responses of compounds that activate the Choline Transporter (CHT) - 10 point CRC PubChem Bioassay(2012)[AID]
 
High affinity choline transporter 1
Name:High affinity choline transporter 1
Type:PROTEIN
Mol. Mass.:63194.33
Organism:Homo sapiens (Human)
Description:ChEMBL_1464247
Residue:580
BDBM78811
NameBDBM78811
Synonyms:3-cyclohexyl-N-[2-[(3S,6S)-6-[(4-methoxyphenyl)methyl]-3-(phenylmethyl)-2,3,5,6-tetrahydroimidazo[1,2-a]imidazol-7-yl]ethyl]propanamide N-[2-[(3S,6S)-3-benzyl-6-[(4-methoxyphenyl)methyl]-2,3,5,6-tetrahydroimidazo[1,2-a]imidazol-7-yl]ethyl]-3-cyclohexylpropanamide SMR000386399 | cid_16195624
TypeSmall organic molecule
Emp. Form.C31H42N4O2
Mol. Mass.502.6908
SMILESCOc1ccc(C[C@H]2CN3[C@@H](Cc4ccccc4)CN=C3N2CCNC(=O)CCC2CCCCC2)cc1