Reaction Details
TargetHigh affinity choline transporter 1
LigandBDBM89162
Substrate/Competitorn/a
Meas. Tech.Dose responses of compounds that activate the Choline Transporter (CHT) - 10 point CRC
EC50 20900±n/a nM
Citation PubChem, PC Dose responses of compounds that activate the Choline Transporter (CHT) - 10 point CRC PubChem Bioassay(2012)[AID]
 
High affinity choline transporter 1
Name:High affinity choline transporter 1
Type:PROTEIN
Mol. Mass.:63194.33
Organism:Homo sapiens (Human)
Description:ChEMBL_1464247
Residue:580
BDBM89162
NameBDBM89162
Synonyms:(3,4-Dimethoxy-benzyl)-[3-(4-fluoro-phenyl)-3-(4-methoxy-phenyl)-propyl]-amine N-[(3,4-dimethoxyphenyl)methyl]-3-(4-fluorophenyl)-3-(4-methoxyphenyl)-1-propanamine SMR000437778 cid_4422455
TypeSmall organic molecule
Emp. Form.C25H28FNO3
Mol. Mass.409.4931
SMILESCOc1ccc(cc1)C(CCNCc1ccc(OC)c(OC)c1)c1ccc(F)cc1