Reaction Details
TargetHigh affinity choline transporter 1
LigandBDBM89177
Substrate/Competitorn/a
Meas. Tech.Dose responses of compounds that activate the Choline Transporter (CHT) - 10 point CRC
EC50 14630±n/a nM
Citation PubChem, PC Dose responses of compounds that activate the Choline Transporter (CHT) - 10 point CRC PubChem Bioassay(2012)[AID]
 
High affinity choline transporter 1
Name:High affinity choline transporter 1
Type:PROTEIN
Mol. Mass.:63194.33
Organism:Homo sapiens (Human)
Description:ChEMBL_1464247
Residue:580
BDBM89177
NameBDBM89177
Synonyms:MLS001140154 N-methyl-N-[2-oxidanylidene-2-[[2,3,4-tris(fluoranyl)phenyl]amino]ethyl]-2-pyridin-4-yl-quinoline-4-carboxamide N-methyl-N-[2-oxo-2-(2,3,4-trifluoroanilino)ethyl]-2-pyridin-4-ylquinoline-4-carboxamide cid_24686286
TypeSmall organic molecule
Emp. Form.C24H17F3N4O2
Mol. Mass.450.4126
SMILESCN(CC(=O)Nc1ccc(F)c(F)c1F)C(=O)c1cc(nc2ccccc12)-c1ccncc1