Reaction Details
TargetDNA (cytosine-5)-methyltransferase 1
LigandBDBM31698
Substrate/Competitorn/a
Meas. Tech.Dose response confirmation of DNMT1 inhibitors in a Fluorescent Molecular Beacon assay
IC50 2920±138 nM
Citation PubChem, PC Dose response confirmation of DNMT1 inhibitors in a Fluorescent Molecular Beacon assay PubChem Bioassay(2012)[AID]
 
DNA (cytosine-5)-methyltransferase 1
Name:DNA (cytosine-5)-methyltransferase 1
Type:Enzyme
Mol. Mass.:183184.85
Organism:Homo sapiens (Human)
Description:P26358
Residue:1616
BDBM31698
NameBDBM31698
Synonyms:3-bromanyl-5-(3,3-dimethylpiperidin-1-yl)carbonyl-pyran-2-one 3-bromo-5-[(3,3-dimethyl-1-piperidinyl)-oxomethyl]-2-pyranone SMR000044848 | cid_664033
TypeSmall organic molecule
Emp. Form.C13H16BrNO3
Mol. Mass.314.175
SMILESCC1(C)CCCN(C1)C(=O)c1coc(=O)c(Br)c1