Reaction Details
TargetDNA (cytosine-5)-methyltransferase 1
LigandBDBM31715
Substrate/Competitorn/a
Meas. Tech.Dose response confirmation of DNMT1 inhibitors in a Fluorescent Molecular Beacon assay
IC50 1180±51 nM
Citation PubChem, PC Dose response confirmation of DNMT1 inhibitors in a Fluorescent Molecular Beacon assay PubChem Bioassay(2012)[AID]
 
DNA (cytosine-5)-methyltransferase 1
Name:DNA (cytosine-5)-methyltransferase 1
Type:Enzyme
Mol. Mass.:183184.85
Organism:Homo sapiens (Human)
Description:P26358
Residue:1616
BDBM31715
NameBDBM31715
Synonyms:3-[(4Z)-4-[(E)-3-(2-furanyl)prop-2-enylidene]-3-methyl-5-oxo-1-pyrazolyl]benzoic acid 3-[(4Z)-4-[(E)-3-(furan-2-yl)prop-2-enylidene]-3-methyl-5-oxidanylidene-pyrazol-1-yl]benzoic acid 3-{4-[3-(2-furyl)-2-propenylidene]-3-methyl-5-oxo-4,5-dihydro-1H-pyrazol-1-yl}benzoic acid SMR000113614 | cid_9549698
TypeSmall organic molecule
Emp. Form.C18H14N2O4
Mol. Mass.322.3148
SMILESOC(=O)c1cccc(c1)-n1[nH]c(=C)c(=CC=Cc2ccco2)c1=O