Reaction Details
TargetDNA (cytosine-5)-methyltransferase 1
LigandBDBM50176
Substrate/Competitorn/a
Meas. Tech.Dose response confirmation of DNMT1 inhibitors in a Fluorescent Molecular Beacon assay
IC50 2860±99 nM
Citation PubChem, PC Dose response confirmation of DNMT1 inhibitors in a Fluorescent Molecular Beacon assay PubChem Bioassay(2012)[AID]
 
DNA (cytosine-5)-methyltransferase 1
Name:DNA (cytosine-5)-methyltransferase 1
Type:Enzyme
Mol. Mass.:183184.85
Organism:Homo sapiens (Human)
Description:P26358
Residue:1616
BDBM50176
NameBDBM50176
Synonyms:(4E)-2-(1,3-benzothiazol-2-yl)-5-[(4-chlorophenyl)sulfanylmethyl]-4-[(4-methoxyphenyl)methylidene]pyrazol-3-one (4E)-2-(1,3-benzothiazol-2-yl)-5-[[(4-chlorophenyl)thio]methyl]-4-p-anisylidene-2-pyrazolin-3-one MLS000571377 cid_5727347
TypeSmall organic molecule
Emp. Form.C25H18ClN3O2S2
Mol. Mass.492.012
SMILESCOc1ccc(C=c2c(=CSc3ccc(Cl)cc3)[nH]n(-c3nc4ccccc4s3)c2=O)cc1