Reaction Details
TargetDNA (cytosine-5)-methyltransferase 1
LigandBDBM50256
Substrate/Competitorn/a
Meas. Tech.Dose response confirmation of DNMT1 inhibitors in a Fluorescent Molecular Beacon assay
IC50 3390±285 nM
Citation PubChem, PC Dose response confirmation of DNMT1 inhibitors in a Fluorescent Molecular Beacon assay PubChem Bioassay(2012)[AID]
 
DNA (cytosine-5)-methyltransferase 1
Name:DNA (cytosine-5)-methyltransferase 1
Type:Enzyme
Mol. Mass.:183184.85
Organism:Homo sapiens (Human)
Description:P26358
Residue:1616
BDBM50256
NameBDBM50256
Synonyms:(5E)-1-butyl-5-[(E)-3-(2-furanyl)prop-2-enylidene]-2-sulfanylidene-1,3-diazinane-4,6-dione (5E)-1-butyl-5-[(E)-3-(furan-2-yl)prop-2-enylidene]-2-sulfanylidene-1,3-diazinane-4,6-dione MLS000587066 cid_1595371
TypeSmall organic molecule
Emp. Form.C15H16N2O3S
Mol. Mass.304.364
SMILESCCCCN1C(=S)NC(=O)\C(=C/C=C/c2ccco2)C1=O