Reaction Details
TargetDNA (cytosine-5)-methyltransferase 1
LigandBDBM84008
Substrate/Competitorn/a
Meas. Tech.Dose response confirmation of DNMT1 inhibitors in a Fluorescent Molecular Beacon assay
IC50 3260±83 nM
Citation PubChem, PC Dose response confirmation of DNMT1 inhibitors in a Fluorescent Molecular Beacon assay PubChem Bioassay(2012)[AID]
 
DNA (cytosine-5)-methyltransferase 1
Name:DNA (cytosine-5)-methyltransferase 1
Type:Enzyme
Mol. Mass.:183184.85
Organism:Homo sapiens (Human)
Description:P26358
Residue:1616
BDBM84008
NameBDBM84008
Synonyms:2-[[4-[2-[(4-methylsulfanylphenyl)methylidene]hydrazinyl]-3-nitro-phenyl]sulfonylamino]benzoic acid 2-[[4-[2-[[4-(methylthio)phenyl]methylidene]hydrazinyl]-3-nitrophenyl]sulfonylamino]benzoic acid MLS002245633 cid_3292268
TypeSmall organic molecule
Emp. Form.C21H18N4O6S2
Mol. Mass.486.521
SMILESCSc1ccc(CN=Nc2ccc(cc2[N+]([O-])=O)S(=O)(=O)Nc2ccccc2C(O)=O)cc1