Reaction Details
TargetDNA (cytosine-5)-methyltransferase 1
LigandBDBM31759
Substrate/Competitorn/a
Meas. Tech.Dose response confirmation of DNMT1 inhibitors in a Fluorescent Molecular Beacon assay
IC50 1020±66 nM
Citation PubChem, PC Dose response confirmation of DNMT1 inhibitors in a Fluorescent Molecular Beacon assay PubChem Bioassay(2012)[AID]
 
DNA (cytosine-5)-methyltransferase 1
Name:DNA (cytosine-5)-methyltransferase 1
Type:Enzyme
Mol. Mass.:183184.85
Organism:Homo sapiens (Human)
Description:P26358
Residue:1616
BDBM31759
NameBDBM31759
Synonyms:2-[5-[(Z)-(3-bromanyl-8-oxidanylidene-[1,3]thiazolo[4,5]imidazo[1,2-b]pyridin-7-ylidene)methyl]furan-2-yl]benzoic acid 2-[5-[(Z)-(3-bromo-8-oxo-7-thiazolo[4,5]imidazo[1,2-b]pyridinylidene)methyl]-2-furanyl]benzoic acid MLS-0090801.0001 | cid_1357397
TypeSmall organic molecule
Emp. Form.C20H10BrN3O4S
Mol. Mass.468.28
SMILESOC(=O)c1ccccc1-c1ccc(\C=c2/sc3nc4cc(Br)cnc4n3c2=O)o1