Reaction Details
TargetDNA (cytosine-5)-methyltransferase 1
LigandBDBM46214
Substrate/Competitorn/a
Meas. Tech.Dose response confirmation of DNMT1 inhibitors in a Fluorescent Molecular Beacon assay
IC50 8420±323 nM
Citation PubChem, PC Dose response confirmation of DNMT1 inhibitors in a Fluorescent Molecular Beacon assay PubChem Bioassay(2012)[AID]
 
DNA (cytosine-5)-methyltransferase 1
Name:DNA (cytosine-5)-methyltransferase 1
Type:Enzyme
Mol. Mass.:183184.85
Organism:Homo sapiens (Human)
Description:P26358
Residue:1616
BDBM46214
NameBDBM46214
Synonyms:2-[4-[[5-(4-chlorophenyl)-6-ethoxycarbonyl-7-methyl-3-oxidanylidene-5H-[1,3]thiazolo[3,2-a]pyrimidin-2-ylidene]methyl]phenoxy]ethanoic acid 2-[4-[[5-(4-chlorophenyl)-6-ethoxycarbonyl-7-methyl-3-oxo-5H-thiazolo[3,2-a]pyrimidin-2-ylidene]methyl]phenoxy]acetic acid MLS-0351016.0001 | cid_2878586
TypeSmall organic molecule
Emp. Form.C25H21ClN2O6S
Mol. Mass.512.962
SMILESCCOC(=O)C1=C(C)N=c2sc(=Cc3ccc(OCC(O)=O)cc3)c(=O)n2C1c1ccc(Cl)cc1