Reaction Details
TargetZinc finger protein GLI1
LigandBDBM49427
Substrate/Competitorn/a
Meas. Tech.Dose response confirmation of uHTS antagonist hits from Gli-SUFU in a luminescent reporter assay
IC50 954±n/a nM
Citation PubChem, PC Dose response confirmation of uHTS antagonist hits from Gli-SUFU in a luminescent reporter assay PubChem Bioassay(2012)[AID]
 
Zinc finger protein GLI1
Name:Zinc finger protein GLI1
Type:PROTEIN
Mol. Mass.:118579.34
Organism:Mus musculus
Description:EBI_101259
Residue:1111
BDBM49427
NameBDBM49427
Synonyms:(4-heptoxyphenyl) pyridine-4-carboxylate MLS000518872 cid_5205672 | isonicotinic acid (4-heptoxyphenyl) ester
TypeSmall organic molecule
Emp. Form.C19H23NO3
Mol. Mass.313.3908
SMILESCCCCCCCOc1ccc(OC(=O)c2ccncc2)cc1