Reaction Details
TargetZinc finger protein GLI1
LigandBDBM42062
Substrate/Competitorn/a
Meas. Tech.Dose response confirmation of uHTS antagonist hits from Gli-SUFU in a luminescent reporter assay
IC50 887±n/a nM
Citation PubChem, PC Dose response confirmation of uHTS antagonist hits from Gli-SUFU in a luminescent reporter assay PubChem Bioassay(2012)[AID]
 
Zinc finger protein GLI1
Name:Zinc finger protein GLI1
Type:PROTEIN
Mol. Mass.:118579.34
Organism:Mus musculus
Description:EBI_101259
Residue:1111
BDBM42062
NameBDBM42062
Synonyms:2,3-dihydro-1,4-benzodioxin-3-ylmethyl(thieno[2,3-d]pyrimidin-4-yl)amine N-(2,3-dihydro-1,4-benzodioxin-3-ylmethyl)-4-thieno[2,3-d]pyrimidinamine SMR000255183 | cid_3457853
TypeSmall organic molecule
Emp. Form.C15H13N3O2S
Mol. Mass.299.348
SMILESC(Nc1ncnc2sccc12)C1COc2ccccc2O1