Reaction Details
TargetZinc finger protein GLI1
LigandBDBM67050
Substrate/Competitorn/a
Meas. Tech.Dose response confirmation of uHTS antagonist hits from Gli-SUFU in a luminescent reporter assay
IC50 2440±n/a nM
Citation PubChem, PC Dose response confirmation of uHTS antagonist hits from Gli-SUFU in a luminescent reporter assay PubChem Bioassay(2012)[AID]
 
Zinc finger protein GLI1
Name:Zinc finger protein GLI1
Type:PROTEIN
Mol. Mass.:118579.34
Organism:Mus musculus
Description:EBI_101259
Residue:1111
BDBM67050
NameBDBM67050
Synonyms:4-[(4-ethoxyphenoxy)methyl]-N'-[(Z)-2-pyrrolylidenemethyl]benzohydrazide MLS002245189 cid_42912529
TypeSmall organic molecule
Emp. Form.C21H21N3O3
Mol. Mass.363.4097
SMILESCCOc1ccc(OCc2ccc(cc2)C(=O)NN=Cc2ccc[nH]2)cc1