Reaction Details
TargetBeta-2 adrenergic receptor
LigandBDBM84203
Substrate/Competitorn/a
Meas. Tech.Dose response for HTS for Beta-2AR agonists via FAP method from Powderset2
EC50 1310±n/a nM
Citation PubChem, PC Dose response for HTS for Beta-2AR agonists via FAP method from Powderset2 PubChem Bioassay(2012)[AID]
 
Beta-2 adrenergic receptor
Name:Beta-2 adrenergic receptor
Type:n/a
Mol. Mass.:46461.69
Organism:Homo sapiens (Human)
Description:P07550
Residue:413
BDBM84203
NameBDBM84203
Synonyms:4-[[1-oxo-2-(5-phenyl-2-tetrazolyl)ethyl]amino]benzoic acid ethyl ester MLS000044008 cid_1267856 ethyl 4-[[2-(5-phenyltetrazol-2-yl)acetyl]amino]benzoate | ethyl 4-{[(5-phenyl-2H-tetrazol-2-yl)acetyl]amino}benzoate
TypeSmall organic molecule
Emp. Form.C18H17N5O3
Mol. Mass.351.3593
SMILESCCOC(=O)c1ccc(NC(=O)Cn2nnc(n2)-c2ccccc2)cc1