Reaction Details
TargetBeta-2 adrenergic receptor
LigandBDBM84321
Substrate/Competitorn/a
Meas. Tech.Dose response for HTS for Beta-2AR agonists via FAP method from Powderset2
EC50 357±n/a nM
Citation PubChem, PC Dose response for HTS for Beta-2AR agonists via FAP method from Powderset2 PubChem Bioassay(2012)[AID]
 
Beta-2 adrenergic receptor
Name:Beta-2 adrenergic receptor
Type:n/a
Mol. Mass.:46461.69
Organism:Homo sapiens (Human)
Description:P07550
Residue:413
BDBM84321
NameBDBM84321
Synonyms:4-Chloro-N-methyl-N-[2-oxo-2-(4-pyridin-2-yl-piperazin-1-yl)-ethyl]-benzenesulfonamide 4-chloro-N-[2-keto-2-[4-(2-pyridyl)piperazino]ethyl]-N-methyl-benzenesulfonamide 4-chloro-N-methyl-N-[2-oxo-2-[4-(2-pyridinyl)-1-piperazinyl]ethyl]benzenesulfonamide SMR000613536 | cid_3164412
TypeSmall organic molecule
Emp. Form.C18H21ClN4O3S
Mol. Mass.408.902
SMILESCN(CC(=O)N1CCN(CC1)c1ccccn1)S(=O)(=O)c1ccc(Cl)cc1